هزینه
preferred label: cost @en
type: Concept
narrower: هزینه واقعی

هزینه واقعی
alternative label: هوکا
scope note: مجموع هزینه‌های صرف‌شده برای انجام یک فعالیت در یک بازۀ زمانی مشخص
broader: هزینه
preferred label: actual cost @en
type: Concept