امور مالی
preferred label: finance @en
type: Concept
narrower: برآورد هزینه

برآورد هزینه
scope note: تخمین منابع لازم برای تکمیل فعالیت‌های پروژه
broader: امور مالی
preferred label: cost estimating @en
type: Concept