انحراف هزینه
scope note: تفاوت بین هزینۀ بودجه‌ای و هزینۀ واقعی یک فعالیت
broader: امور مالی
preferred label: cost variance @en
type: Concept

امور مالی
preferred label: finance @en
type: Concept
narrower: انحراف هزینه