هزینه کارکرد
scope note: بخشی از هزینه‌ای که کاربر خدمات مخابراتی باید بپردازد و با مصرف واقعی خدمات مخابراتی متناسب است و براساس تعداد، مدت، فاصله یا زمان تماس تعیین می‌شود.
broader: دستمزد و هزینه
preferred label: usage charge @en
type: Concept

دستمزد و هزینه
preferred label: fees and charge @en
type: Concept
narrower: هزینه کارکرد