جت
preferred label: jet @en
type: Concept
related: طغیان جتی

طغیان جتی
scope note: جریان کاملاً توسعه‌یافتۀ افشانه‌ای که در آن جت بخار خروجی از سوراخ‌های سینی موجب همراه‌بری توأم با اتمی ‌شدن مایع می‌شود.
related: جت
broader: طغیان
preferred label: jet flooding @en
type: Concept

طغیان
preferred label: flooding @en
type: Concept
narrower: طغیان جتی