کانونش محوری
scope note: متمرکز کردن امواج ضربۀ منعکس‌شده از دیوارۀ تونل اَبَرصوتی بر روی محور اصلی آن
broader: کانونش
preferred label: axial focusing @en
type: Concept

کانونش
preferred label: focusing @en
type: Concept
narrower: کانونش محوری