حفاظت جنگل
preferred label: forest conservation @en
type: Concept
related: جنگل‌داری حفاظتی

جنگل‌داری
preferred label: forestry @en
type: Concept
narrower: جنگل‌داری حفاظتی

جنگل‌داری حفاظتی
scope note: یکی از شیوه‌های برنامه‌ریزی و مدیریت جنگل که عمدتاً بر حفاظت آن تأکید می‌کند.
related: حفاظت جنگل
broader: جنگل‌داری
preferred label: protection forestry @en
type: Concept