بسامد
preferred label: frequency @en
type: Concept
narrower: بسامد رادیویی

بسامد رادیویی
scope note: بسامد تابش الکترومغناطیسی در بازۀ بین ده کیلوهرتز تا سیصد گیگاهرتز
broader: بسامد
preferred label: radio frequency @en
type: Concept