کهکشان
scope note: مجموعۀ عظیمی از هزاران‌هزار ستاره و غبار و گاز که به دور مرکز مشترکی می‌چرخند.
related: اخترفیزیک
related: نجوم
preferred label: galaxy @en
type: Concept

اخترفیزیک
preferred label: astrophysics @en
type: Concept
related: کهکشان

نجوم
preferred label: astronomy @en
type: Concept
related: کهکشان