سلامت بوم‌سازگان
scope note: سالم‌ بودن بوم‌سازگان و عوامل زیستی و فرایندهای تشکیل‌دهندۀ آن
broader: سلامت
preferred label: ecosystem health @en
type: Concept

سلامت
preferred label: health @en
type: Concept
narrower: سلامت بوم‌سازگان