سلامت
preferred label: health @en
type: Concept
narrower: سلامت روانی

سلامت روانی
scope note: توانایی واکنش انعطاف‌پذیر و هدفمند به انواع تجارب زندگی
broader: سلامت
preferred label: mental health @en
type: Concept