سلامت جسمانی
scope note: وضعیتی که در آن همۀ یاخته‌ها و اعضای بدن با ظرفیت بهینه و در هماهنگی کامل با یکدیگر کار می‌کنند.
broader: سلامت
preferred label: physical health @en
type: Concept

سلامت
preferred label: health @en
type: Concept
narrower: سلامت جسمانی