سلامت
preferred label: health @en
type: Concept
narrower: سلامت اجتماعی

سلامت اجتماعی
scope note: توانایی فرد در ایجاد ارتباط با محیط اجتماعی
broader: سلامت
preferred label: social health @en
type: Concept