تغذیه
preferred label: nutrition @en
type: Concept
narrower: تغذیه نوجوانان

تغذیه نوجوانان
scope note: تغذیه‌ای با هدف جلوگیری از بیماری و ارتقای سلامت و رشد و بالندگی مطلوب در نوجوانان
broader: تغذیه
preferred label: adolescent nutrition @en
type: Concept