تغذیه
preferred label: nutrition @en
type: Concept
narrower: تغذیه کودکی

تغذیه کودکی
scope note: تغذیۀ کودکان سالم براساس الگویی متناسب برای بازۀ سنی دو تا یازده‌ سالگی
broader: تغذیه
preferred label: childhood nutrition @en
type: Concept