تغذیه سالمندان
scope note: تغذیه‌ای که هدف از آن به تعویق انداختن عوارض پیری و بیماری‌ها و کمک به مدیریت تغییرات ناخوشایند ناشی از پیری است.
broader: تغذیه
preferred label: geriatric nutrition @en
type: Concept

تغذیه
preferred label: nutrition @en
type: Concept
narrower: تغذیه سالمندان