تاب‌کاری شیشه
preferred label: glass annealing @en
type: Concept
narrower: تاب‌کاری کم‌دما

تاب‌کاری کم‌دما
scope note: حرارت دادن ورق‌های نورد گرم‌شدۀ آهنی در یک کورۀ باز، به‌نحوی‌که ورق‌ها در بازۀ تغییر حالت قرار گیرند و سپس سرد کردن آنها در هوا برای نرم شدن
broader: تاب‌کاری شیشه
preferred label: blue annealing @en
type: Concept