کربن‌زدایی
scope note: زدودن کربن از لایۀ سطحی آلیاژ کربن‌دار در جریان کار گرم (hot working) یا حرارت‌دهی مجدد ازطریق تماس‌ دادن سطح آلیاژ با یک یا چند مادۀ شیمیایی و واکنشی که در پی دارد.
related: کربن
broader: عملیات حرارتی
preferred label: decarburization @en
type: Concept

کربن
preferred label: carbon @en
type: Concept
related: کربن‌زدایی

عملیات حرارتی
preferred label: heat treatment @en
type: Concept
narrower: کربن‌زدایی