سردایش
preferred label: quenching @en
type: Concept
narrower: سردایش هواراند

سردایش هواراند
scope note: سرد کردن سریع قطعات کوچک فولاد آلیاژی با دمیدن هوای فشرده
broader: سردایش
preferred label: forced-air quenching @en
type: Concept