سردایش
preferred label: quenching @en
type: Concept
narrower: سردایش گسسته

سردایش گسسته
scope note: فرایندی که در آن قطعه را درحالی‌که هنوز دمایی بالاتر از دمای محیط سردایش دارد، از آن خارج می‌کنند و در سامانۀ سردایش دیگری با سرعت سرمادهی متفاوت قرار می‌دهند.
broader: سردایش
preferred label: interrupted quenching @en
type: Concept