عملیات گرماشیمیایی
scope note: عملیات حرارتی در یک محیط واسطۀ مناسب برای ایجاد تغییر در ترکیب شیمیایی قطعه به‌کمک تبادل گرما با محیط واسطه
broader: عملیات حرارتی
preferred label: thermochemical treatment @en
type: Concept

عملیات حرارتی
preferred label: heat treatment @en
type: Concept
narrower: عملیات گرماشیمیایی