پسماند (الکتریسیته)
preferred label: hysteresis @en
type: Concept
narrower: پسماند فروالکتریکی

پسماند فروالکتریکی
scope note: قطبش برجای‌مانده از مواد فرّوالکتریکی پس از حذف میدان الکتریکی پیشین
broader: پسماند (الکتریسیته)
preferred label: ferroelectric hysteresis @en
type: Concept