پسماند (الکتریسیته)
preferred label: hysteresis @en
type: Concept
narrower: پسماند فشاربرقی

پسماند فشاربرقی
alternative label: پسماند پیزوالکتریکی
scope note: رفتار پسماندی بلور فشاربرقی/ پیزوالکتریکی که قطبش الکتریکی آن علاوه بر تنش مکانیکی به پیشینۀ تنش‌های اعمال‌شده بستگی دارد.
broader: پسماند (الکتریسیته)
preferred label: piezoelectric hysteresis @en
type: Concept