آبیاری کرتی
scope note: نوعی آبیاری غرقابی که درآن زمین را در قطعاتی با پشته محصور می‌کنند و آب را در آنها رها می‌سازند.
broader: آبیاری
preferred label: basin irrigation @en
type: Concept

آبیاری
preferred label: irrigation @en
type: Concept
narrower: آبیاری کرتی