آبیاری
preferred label: irrigation @en
type: Concept
narrower: آبیاری تراز

آبیاری تراز
scope note: روشی در آبیاری زمین‌های شیب‌دار که در آن جویچه‌ها بر روی خطوط تراز کنده می‌شوند تا فرسایش خاک براثر آبیاری به کمترین میزان برسد.
broader: آبیاری
preferred label: contour irrigation @en
type: Concept