کشاورزی
preferred label: agriculture @en
type: Concept
narrower: کشاورزی معیشتی

کشاورزی معیشتی
scope note: نوعی کشاورزی که محصولات آن معمولاً تنها برای مصرف خانوادۀ کشاورز کافی است.
broader: کشاورزی
preferred label: subsistence agriculture @en
type: Concept