کشاورزی
preferred label: agriculture @en
type: Concept
narrower: کشاورزی پایدار

کشاورزی پایدار
scope note: نوعی کشاورزی که در آن با به‌کارگیری حداقل نهاده‌های خارجی، به‌غیراز کودهای آلی، جنبه‌های مختلف زیست‌محیطی و اقتصادی و اجتماعی و سیاسی لحاظ شود.
broader: کشاورزی
preferred label: sustainable agriculture @en
type: Concept