زبان‌شناسی کاربردی
scope note: شاخه‌ای از زبان‌شناسی که با استفاده از یافته‌های زبان‌شناسی نظری و توصیفی به حل مسائل زبانی دیگر رشته‌ها می‌پردازد.
broader: زبان‌شناسی
preferred label: applied linguistics @en
type: Concept

زبان‌شناسی
preferred label: linguistics @en
type: Concept
narrower: زبان‌شناسی کاربردی