زبان‌شناسی انتقادی
scope note: شاخه‌ای از زبان‌شناسی که هدف آن دستیابی به جنبه‌های ارزشی و اعتقادی و کشف روابط قدرت نهفته در متن است.
broader: زبان‌شناسی
preferred label: critical linguistics @en
type: Concept

زبان‌شناسی
preferred label: linguistics @en
type: Concept
narrower: زبان‌شناسی انتقادی