آمار
preferred label: statistics @en
type: Concept
related: زبان‌شناسی آماری

زبان‌شناسی آماری
scope note: شاخه‌ای از زبان‌شناسی که با استفاده از روش‌های آماری به بررسی جنبه‌های مختلف زبان می‌پردازد.
related: آمار
broader: زبان‌شناسی
preferred label: statistical linguistics @en
type: Concept

زبان‌شناسی
preferred label: linguistics @en
type: Concept
narrower: زبان‌شناسی آماری