میانای برنامه کاربردی
alternative label: م. ب. ک.
scope note: میانای سامانۀ عامل و برنامه‌های کاربردی که نحوۀ ارتباط این دو را با یکدیگر مشخص می‌کند.
broader: واسط (رایانه)
preferred label: application program interface @en
type: Concept

واسط (رایانه)
preferred label: interface (computer) @en
type: Concept
narrower: میانای برنامه کاربردی