میانای مغز‌ـ رایانه
scope note: میانای پیشرفته‌ای که نشانک‌های فعالیت مغز را به فرمان‌های قابل استفاده تبدیل می‌کنند.
broader: واسط (رایانه)
preferred label: brain-computer interface @en
type: Concept

واسط (رایانه)
preferred label: interface (computer) @en
type: Concept
narrower: میانای مغز‌ـ رایانه