میانای مدیریت داده‌های اَبر
scope note: نوعی میانای کارکردی که در برنامه‌های کاربردی برای ایجاد و بازیابی و روزآمد کردن و حذف عناصر داده‌ای در اَبر از آن استفاده می‌شود.
broader: واسط (رایانه)
preferred label: cloud data management interface @en
type: Concept

واسط (رایانه)
preferred label: interface (computer) @en
type: Concept
narrower: میانای مدیریت داده‌های اَبر