مهارافزار
preferred label: moorings @en
type: Concept
narrower: مهار چهارزنجیره

مهار چهارزنجیره
scope note: نوعی مهار که در آن با استفاده از چهار زنجیر از دو سوی سینه و چارک‌ها، شناور را مهار می‌کنند.
broader: مهارافزار
preferred label: all fours moorings @en
type: Concept