مهارافزار
preferred label: moorings @en
type: Concept
narrower: مهار بالتیکی

مهار بالتیکی
scope note: وعی مهار شناور که در آن یک طناب یا بافه به سر لنگر بسته می‌شود و پس از انداختن لنگر و حرکت جانبی به‌سمت اسکله، شناور از سمت اسکله با طناب مهار می‌شود.
broader: مهارافزار
preferred label: Baltic moor @en
type: Concept