مهارافزار
preferred label: moorings @en
type: Concept
narrower: مهار شناوه‌ای

شناوه مهار
preferred label: mooring buoy @en
type: Concept
related: مهار شناوه‌ای

مهار شناوه‌ای
alternative label: مهار بویه‌ای
scope note: نوعی مهار که در آن شناور را به یک شناوه/ بویۀ مهار می‌بندند.
related: شناوه مهار
broader: مهارافزار
preferred label: buoy moorings @en
type: Concept