مهارافزار
preferred label: moorings @en
type: Concept
narrower: دهنه مهار

دهنه مهار
scope note: طناب یا زنجیری که دو سر آن را به عرشۀ شناور می‌بندند و طناب یدک‌کشی به میانۀ آن وصل می‌شود.
broader: مهارافزار
preferred label: mooring bridle @en
type: Concept