مهارافزار
preferred label: moorings @en
type: Concept
narrower: هادی طناب

هادی طناب
scope note: سازه‌ای از آهن ریختگی بر روی عرشۀ کشتی که دارای لبه‌های قوسی برای هدایت طناب‌های مهار است.
broader: مهارافزار
preferred label: mooring chock @en
type: Concept