مهارافزار
preferred label: moorings @en
type: Concept
narrower: قلاب بدنه

قلاب بدنه
scope note: میلۀ آهنی محکم و ستبری که در نزدیکی خط آب به بدنۀ کشتی وصل شده است و می‌توان طناب‌های مهار را به آن بست.
broader: مهارافزار
preferred label: mooring dog @en
type: Concept