مهارافزار
preferred label: moorings @en
type: Concept
narrower: طناب مهار

طناب مهار
alternative label: بافه مهار
scope note: طناب یا بافه‌ای که از آن برای بستن شناور به اسکله استفاده می‌شود.
broader: مهارافزار
preferred label: mooring line @en
type: Concept