مهارافزار
preferred label: moorings @en
type: Concept
narrower: بند زنجیر مهار

بند زنجیر مهار
scope note: زنجیر کوتاهی که یک سر آن به شناوه/ بویۀ مهار و سر دیگر آن به زنجیر بستر دریا (ground chain) بسته می‌شود.
broader: مهارافزار
preferred label: mooring pendant @en
type: Concept