مهارافزار
preferred label: moorings @en
type: Concept
narrower: درگاه مهار

درگاه مهار
scope note: قطعۀ ریختگی سوراخ‌داری که بر روی بارو (bulwark) پرچ یا جوش داده می‌شود و طناب‌های مهار را از داخل سوراخ آن می‌گذرانند.
broader: مهارافزار
preferred label: mooring pipe @en
type: Concept