نشست خودکار
scope note: نشست دقیق و ایمن هواگَرد با استفاده از سامانۀ واپایش پرواز خودکار
related: خودکارسازی
broader: فرود
preferred label: automatic landing @en
type: Concept

خودکارسازی
preferred label: automation @en
type: Concept
related: نشست خودکار

فرود
preferred label: landing @en
type: Concept
narrower: نشست خودکار