زمین‌لغزه
preferred label: landslide @en
type: Concept
narrower: زمین‌لغزه چرخشی

زمین‌لغزه چرخشی
scope note: زمین‌لغزه‌ای که در آن برش در امتداد سطحی منحنی رخ داده است.
broader: زمین‌لغزه
preferred label: rotational landslide @en
type: Concept