نگهداری بوم‌سازگان جنگلی
scope note: تمامی فعالیت‌هایی که به حفظ وضعیت موجود بوم‌سازگان جنگلی منجر می‌شود.
related: بوم‌سازگان
broader: نگهداری
preferred label: forest ecosystem maintenance @en
type: Concept

بوم‌سازگان
preferred label: ecosystem @en
type: Concept
related: نگهداری بوم‌سازگان جنگلی

نگهداری
preferred label: maintenance @en
type: Concept
narrower: نگهداری بوم‌سازگان جنگلی