نگهداری وفقی
scope note: یکی از انواع نگهداری نرم‌افزار که در آن کارکرد سامانه را با تغییراتی با نیازهای روز یا پیشرفت‌های فنّاوری سازگار می‌کنند.
broader: نگهداری نرم‌افزار
preferred label: adaptive maintenance @en
type: Concept

نگهداری نرم‌افزار
preferred label: software maintenance @en
type: Concept
narrower: نگهداری وفقی