مدیریت دادگان
preferred label: database management @en
type: Concept
narrower: سرپرستی دادگان

سرپرستی دادگان
alternative label: سرپرستی پایگاه‌داده
scope note: وظیفه یا مسئولیتی که سرپرست دادگان بر عهده دارد.
broader: مدیریت دادگان
preferred label: database administration @en
type: Concept