نشر دادگان
alternative label: نشر پایگاه‌داده
scope note: استفاده از نشر رومیزی یا فنّاوری اینترنت برای تولید گزارش‌هایی حاوی اطلاعات به‌دست‌آمده از یک دادگان
related: دادگان منتشرشده
broader: مدیریت دادگان
preferred label: database publishing @en
type: Concept

دادگان منتشرشده
preferred label: published database @en
type: Concept
related: نشر دادگان

مدیریت دادگان
preferred label: database management @en
type: Concept
narrower: نشر دادگان