مدیریت مواد پسماند
preferred label: waste management @en
type: Concept
narrower: مدیریت یکپارچه پسماند جامد

مدیریت یکپارچه پسماند جامد
scope note: ترکیبی از روش‌های گوناگون مدیریت پسماند جامد شامل کاهش‌درمبدأ و بازچرخش و احتراق و دفن و پوسش
related: پسماند جامد
broader: مدیریت مواد پسماند
preferred label: integrated solid waste management @en
type: Concept

پسماند جامد
preferred label: solid waste @en
type: Concept
related: مدیریت یکپارچه پسماند جامد