نقشه
preferred label: map @en
type: Concept
narrower: نقشه هم‌ضخامت

نقشه هم‌ضخامت
scope note: نقشه‌ای که ضخامت یک لایه یا سازند یا پیکره‌های تختالی دیگر را در ناحیه‌ای جغرافیایی نشان می‌دهد.
broader: نقشه
preferred label: isopach map @en
type: Concept